Reaction Details
TargetGag-Pol polyprotein [484-582,Q491K,I494L,I497V,V499I,E519D,I534V,R541K,D544E,Q553K,A555V,L573M]
LigandBDBM112654
Substrate/Competitorn/a
Meas. Tech.HIV-1 protease inhibition assay
pH4.7±n/a
Temperature298.15±n/a K
Ki 0.006±0.004 nM
Commentsextracted
Citation Nalam, MNAli, AReddy, GSCao, HAnjum, SGAltman, MDYilmaz, NKTidor, BRana, TMSchiffer, CA Substrate envelope-designed potent HIV-1 protease inhibitors to avoid drug resistance. Chem Biol20:1116-24 (2013) 
 
Gag-Pol polyprotein [484-582,Q491K,I494L,I497V,V499I,E519D,I534V,R541K,D544E,Q553K,A555V,L573M]
Name:Gag-Pol polyprotein [484-582,Q491K,I494L,I497V,V499I,E519D,I534V,R541K,D544E,Q553K,A555V,L573M]
Type:Protein
Mol. Mass.:10772.76
Organism:Human immunodeficiency virus
Description:HIV-1 protease mutant (I50V, A71V)
Residue:99
BDBM112654
NameBDBM112654
Synonyms:(3R,3aS,6aR)-Hexahydrofuro[2,3-b]furan-3-yl ((2S,3R)-4-(4-amino-N-((S)-2-methylbutyl)phenylsulfonamido)-3-hydroxy-1-phenylbutan-2-yl)carbamate (10a)
TypeSmall organic molecule
Emp. Form.C28H39N3O7S
Mol. Mass.561.69
SMILESCC[C@H](C)CN(C[C@@H](O)[C@H](Cc1ccccc1)NC(=O)O[C@H]1CO[C@H]2OCC[C@@H]12)S(=O)(=O)c1ccc(N)cc1