Reaction Details
TargetOrexin/Hypocretin receptor type 1
LigandBDBM112670
Substrate/Competitorn/a
Meas. Tech.Radioligand Binding Assay
Ki 42±n/a nM
Citation Coleman, PJFraley, MESchreier, JD Disubstituted azepan orexin receptor antagonists US Patent US8623863 Publication Date 1/7/2014
 
Orexin/Hypocretin receptor type 1
Name:Orexin/Hypocretin receptor type 1
Type:Protein
Mol. Mass.:46817.55
Organism:Rattus norvegicus (Rat)
Description:P56718
Residue:416
BDBM112670
NameBDBM112670
Synonyms:US8623863, 3-3
TypeSmall organic molecule
Emp. Form.C27H30FN3O2
Mol. Mass.447.5444
SMILESCC1CCCC(COc2ccc(F)c(C)c2)CN1C(=O)c1cc(C)ccc1-c1ncccn1