Reaction Details
TargetOrexin receptor type 2
LigandBDBM112673
Substrate/Competitorn/a
Meas. Tech.Radioligand Binding Assay
Ki 14±n/a nM
Citation Coleman, PJFraley, MESchreier, JD Disubstituted azepan orexin receptor antagonists US Patent US8623863 Publication Date 1/7/2014
 
Orexin receptor type 2
Name:Orexin receptor type 2
Type:Protein
Mol. Mass.:50710.53
Organism:Homo sapiens (Human)
Description:O43614
Residue:444
BDBM112673
NameBDBM112673
Synonyms:US8623863, 3-6
TypeSmall organic molecule
Emp. Form.C25H27FN4O2
Mol. Mass.434.5059
SMILESCC1CCCC(COc2ccc(F)cn2)CN1C(=O)c1cc(C)ccc1-c1ncccn1