Reaction Details
TargetOrexin receptor type 2
LigandBDBM112674
Substrate/Competitorn/a
Meas. Tech.Radioligand Binding Assay
Ki 8.7±n/a nM
Citation Coleman, PJFraley, MESchreier, JD Disubstituted azepan orexin receptor antagonists US Patent US8623863 Publication Date 1/7/2014
 
Orexin receptor type 2
Name:Orexin receptor type 2
Type:Protein
Mol. Mass.:50710.53
Organism:Homo sapiens (Human)
Description:O43614
Residue:444
BDBM112674
NameBDBM112674
Synonyms:US8623863, 3-8
TypeSmall organic molecule
Emp. Form.C24H27FN4O3
Mol. Mass.438.4946
SMILESCC1COCC(COc2ccc(F)c(C)c2)CN1C(=O)c1cc(C)ccc1-n1nccn1