Reaction Details
TargetTyrosine-protein kinase JAK2
LigandBDBM113108
Substrate/Competitorn/a
Meas. Tech.Enzymatic Assay
pH7.4±n/a
IC50 48.4±n/a nM
Commentsextracted
Citation Promo, MAXie, JAcker, BAHartmann, SJWolfson, SGHuang, HJacobsen, EJ Pyrrolo[2,3-D]pyrimidine compounds US Patent US8633206 Publication Date 1/21/2014
 
Tyrosine-protein kinase JAK2
Name:Tyrosine-protein kinase JAK2
Type:Protein
Mol. Mass.:130684.68
Organism:Homo sapiens (Human)
Description:O60674
Residue:1132
BDBM113108
NameBDBM113108
Synonyms:US8633206, 26
TypeSmall organic molecule
Emp. Form.C23H36N6O4S
Mol. Mass.492.635
SMILESCN([C@H]1CC[C@H](CS(=O)(=O)N2CC[C@@H](C2)NC(=O)OC(C)(C)C)CC1)c1ncnc2[nH]ccc12