Reaction Details
TargetTyrosine-protein kinase JAK1
LigandBDBM113085
Substrate/Competitorn/a
Meas. Tech.Enzymatic Assay
pH7.4±n/a
IC50 1.2±n/a nM
Commentsextracted
Citation Promo, MAXie, JAcker, BAHartmann, SJWolfson, SGHuang, HJacobsen, EJ Pyrrolo[2,3-D]pyrimidine compounds US Patent US8633206 Publication Date 1/21/2014
 
Tyrosine-protein kinase JAK1
Name:Tyrosine-protein kinase JAK1
Type:Protein
Mol. Mass.:133293.73
Organism:Homo sapiens (Human)
Description:P23458
Residue:1154
BDBM113085
NameBDBM113085
Synonyms:US8633206, 3
TypeSmall organic molecule
Emp. Form.C21H33N5O3S
Mol. Mass.435.583
SMILESCCOC1CCCN(C1)S(=O)(=O)CC1CCC(CC1)N(C)c1ncnc2[nH]ccc12