Reaction Details
TargetTyrosine-protein kinase JAK1
LigandBDBM113142
Substrate/Competitorn/a
Meas. Tech.Enzymatic Assay
pH7.4±n/a
IC50 1.7±n/a nM
Commentsextracted
Citation Promo, MAXie, JAcker, BAHartmann, SJWolfson, SGHuang, HJacobsen, EJ Pyrrolo[2,3-D]pyrimidine compounds US Patent US8633206 Publication Date 1/21/2014
 
Tyrosine-protein kinase JAK1
Name:Tyrosine-protein kinase JAK1
Type:Protein
Mol. Mass.:133293.73
Organism:Homo sapiens (Human)
Description:P23458
Residue:1154
BDBM113142
NameBDBM113142
Synonyms:US8633206, 60
TypeSmall organic molecule
Emp. Form.C20H31N5O3S
Mol. Mass.421.557
SMILESCO[C@@H]1CCCN(C1)S(=O)(=O)C[C@H]1CC[C@@H](CC1)N(C)c1ncnc2[nH]ccc12