Reaction Details
TargetTyrosine-protein kinase JAK1
LigandBDBM113195
Substrate/Competitorn/a
Meas. Tech.Enzymatic Assay
pH7.4±n/a
IC50 1.55±n/a nM
Commentsextracted
Citation Promo, MAXie, JAcker, BAHartmann, SJWolfson, SGHuang, HJacobsen, EJ Pyrrolo[2,3-D]pyrimidine compounds US Patent US8633206 Publication Date 1/21/2014
 
Tyrosine-protein kinase JAK1
Name:Tyrosine-protein kinase JAK1
Type:Protein
Mol. Mass.:133293.73
Organism:Homo sapiens (Human)
Description:P23458
Residue:1154
BDBM113195
NameBDBM113195
Synonyms:US8633206, 113
TypeSmall organic molecule
Emp. Form.C18H25N9O2S
Mol. Mass.431.515
SMILESCN([C@H]1CC[C@H](CS(=O)(=O)N2CC(C2)c2nnn[nH]2)CC1)c1ncnc2[nH]ccc12