Reaction Details
TargetPhosphatidylinositol 4,5-bisphosphate 3-kinase catalytic subunit alpha isoform
LigandBDBM50380313
Substrate/Competitorn/a
Meas. Tech.Biochemical Assay
pH7.4±n/a
Temperature298.15±n/a K
IC50 4.85±n/a nM
Citation Cheng, HBhumralkar, DDress, KRHoffman, JEJohnson, MCKania, RSLe, PTNambu, MDPairish, MAPlewe, MBTran, KT 4-methylpyridopyrimidinone compounds US Patent US8633204 Publication Date 1/21/2014
 
Phosphatidylinositol 4,5-bisphosphate 3-kinase catalytic subunit alpha isoform
Name:Phosphatidylinositol 4,5-bisphosphate 3-kinase catalytic subunit alpha isoform
Type:Enzyme Subunit
Mol. Mass.:124294.87
Organism:Homo sapiens (Human)
Description:P42336
Residue:1068
BDBM50380313
NameBDBM50380313
Synonyms:CHEMBL1234354 | US8633204, 286
TypeSmall organic molecule
Emp. Form.C22H27N5O4
Mol. Mass.425.4809
SMILESCOc1ccc(cn1)-c1cc2c(C)nc(N)nc2n([C@H]2CC[C@@H](CC2)OCCO)c1=O