Reaction Details
TargetPhosphatidylinositol 4,5-bisphosphate 3-kinase catalytic subunit alpha isoform
LigandBDBM50433045
Substrate/Competitorn/a
Meas. Tech.Biochemical Assay
pH7.4±n/a
Temperature298.15±n/a K
IC50 3.87±n/a nM
Citation Cheng, HBhumralkar, DDress, KRHoffman, JEJohnson, MCKania, RSLe, PTNambu, MDPairish, MAPlewe, MBTran, KT 4-methylpyridopyrimidinone compounds US Patent US8633204 Publication Date 1/21/2014
 
Phosphatidylinositol 4,5-bisphosphate 3-kinase catalytic subunit alpha isoform
Name:Phosphatidylinositol 4,5-bisphosphate 3-kinase catalytic subunit alpha isoform
Type:Enzyme Subunit
Mol. Mass.:124294.87
Organism:Homo sapiens (Human)
Description:P42336
Residue:1068
BDBM50433045
NameBDBM50433045
Synonyms:CHEMBL2375964 | US8633204, 303
TypeSmall organic molecule
Emp. Form.C22H26N6O4
Mol. Mass.438.4796
SMILESCOc1ccc(cn1)-c1cc2c(C)nc(N)nc2n([C@@H]2CC[C@@H](CC2)OCC(N)=O)c1=O