Reaction Details
TargetC-C chemokine receptor type 1
LigandBDBM50436285
Substrate/Competitorn/a
Meas. Tech.Binding Assay
Temperature298.15±n/a K
Ki 2.6±n/a nM
Commentsextracted
Citation Santella, JB Piperidinyl derivative as a modulator of chemokine receptor activity US Patent US8633226 Publication Date 1/21/2014
 
C-C chemokine receptor type 1
Name:C-C chemokine receptor type 1
Type:Enzyme
Mol. Mass.:41180.69
Organism:Homo sapiens (Human)
Description:P32246
Residue:355
BDBM50436285
NameBDBM50436285
Synonyms:CHEMBL2398743 | US8633226, 466
TypeSmall organic molecule
Emp. Form.C23H35ClN2O3
Mol. Mass.422.989
SMILESCC(C)CC(=O)N[C@H](C(C)C)C(=O)N1CC[C@](O)(c2ccc(Cl)cc2)C(C)(C)C1