Reaction Details
TargetC-C chemokine receptor type 1
LigandBDBM113726
Substrate/Competitorn/a
Meas. Tech.Binding Assay
Temperature298.15±n/a K
Ki 0.5±n/a nM
Commentsextracted
Citation Santella, JB Piperidinyl derivative as a modulator of chemokine receptor activity US Patent US8633226 Publication Date 1/21/2014
 
C-C chemokine receptor type 1
Name:C-C chemokine receptor type 1
Type:Enzyme
Mol. Mass.:41180.69
Organism:Homo sapiens (Human)
Description:P32246
Residue:355
BDBM113726
NameBDBM113726
Synonyms:US8633226, 850
TypeSmall organic molecule
Emp. Form.C22H34ClN3O3
Mol. Mass.423.977
SMILESCC(C)NC(=O)N[C@H](C(C)C)C(=O)N1CC[C@](O)(c2ccc(Cl)cc2)C(C)(C)C1