Reaction Details
TargetAlpha-galactosidase A
LigandBDBM113756
Substrate/Competitorn/a
Meas. Tech.α-Gal A Assay
pH7±0
IC50 3.7e+2± 45 nM
Citation Yu, YMena-Barragán, TMena-Barragán, KJohnson, JLDrury, JELieberman, RLNakasone, NNinomiya, HTsukimura, TSakuraba, HSuzuki, YNanba, EMellet, COGarcía Fernández, JMGarcía Fernández, K Molecular Basis of 1-Deoxygalactonojirimycin Arylthiourea Binding to Human a-Galactosidase A: Pharmacological Chaperoning Efficacy on Fabry Disease Mutants. ACS Chem Biol9:1460-9 (2014) 
 
Alpha-galactosidase A
Name:Alpha-galactosidase A
Type:Protein
Mol. Mass.:48760.21
Organism:Homo sapiens (Human)
Description:n/a
Residue:429
BDBM113756
NameBDBM113756
Synonyms:DGJ-NphT
TypeSmall organic molecule
Emp. Form.C17H20N2O4S
Mol. Mass.348.417
SMILESOC[C@@H]1[C@H](O)[C@H](O)[C@@H](O)CN1C(=S)Nc1cccc2ccccc12