Reaction Details
TargetAlpha-galactosidase A
LigandBDBM113757
Substrate/Competitorn/a
Meas. Tech.α-Gal A Assay
pH7±0
IC50 16± 2.0 nM
Citation Yu, YMena-Barragán, TMena-Barragán, KJohnson, JLDrury, JELieberman, RLNakasone, NNinomiya, HTsukimura, TSakuraba, HSuzuki, YNanba, EMellet, COGarcía Fernández, JMGarcía Fernández, K Molecular Basis of 1-Deoxygalactonojirimycin Arylthiourea Binding to Human a-Galactosidase A: Pharmacological Chaperoning Efficacy on Fabry Disease Mutants. ACS Chem Biol9:1460-9 (2014) 
 
Alpha-galactosidase A
Name:Alpha-galactosidase A
Type:Protein
Mol. Mass.:48760.21
Organism:Homo sapiens (Human)
Description:n/a
Residue:429
BDBM113757
NameBDBM113757
Synonyms:DGJ-pMe OPhT
TypeSmall organic molecule
Emp. Form.C14H20N2O5S
Mol. Mass.328.384
SMILESCOc1ccc(NC(=S)N2C[C@H](O)[C@@H](O)[C@@H](O)[C@H]2CO)cc1