Reaction Details
TargetAlpha-galactosidase A
LigandBDBM113761
Substrate/Competitorn/a
Meas. Tech.α-Gal A Assay
pH7±0
IC50 4.41e+3± 6.5e+2 nM
Citation Yu, YMena-Barragán, TMena-Barragán, KJohnson, JLDrury, JELieberman, RLNakasone, NNinomiya, HTsukimura, TSakuraba, HSuzuki, YNanba, EMellet, COGarcía Fernández, JMGarcía Fernández, K Molecular Basis of 1-Deoxygalactonojirimycin Arylthiourea Binding to Human a-Galactosidase A: Pharmacological Chaperoning Efficacy on Fabry Disease Mutants. ACS Chem Biol9:1460-9 (2014) 
 
Alpha-galactosidase A
Name:Alpha-galactosidase A
Type:Protein
Mol. Mass.:48760.21
Organism:Homo sapiens (Human)
Description:n/a
Residue:429
BDBM113761
NameBDBM113761
Synonyms:DGJ-BnT
TypeSmall organic molecule
Emp. Form.C14H20N2O4S
Mol. Mass.312.385
SMILESOC[C@@H]1[C@H](O)[C@H](O)[C@@H](O)CN1C(=S)NCc1ccccc1