Reaction Details
TargetCannabinoid receptor 1
LigandBDBM113766
Substrate/Competitorn/a
Meas. Tech.CB1 & 2 Binding Assays
pH7.4±n/a
Temperature303.15±n/a K
Ki 3.83e+3± 3.4e+2 nM
Commentsextracted
Citation Chicca, ACaprioglio, DMinassi, APetrucci, VAppendino, GTaglialatela-Scafati, OGertsch, J Functionalization of ß-Caryophyllene Generates Novel Polypharmacology in the Endocannabinoid System. ACS Chem Biol9:1499-507 (2014) 
 
Cannabinoid receptor 1
Name:Cannabinoid receptor 1
Type:G Protein-Coupled Receptor (GPCR)
Mol. Mass.:52868.96
Organism:Homo sapiens (Human)
Description:P21554
Residue:472
BDBM113766
NameBDBM113766
Synonyms:(E)-N-(2-Chloroethyl)-6-((1R,2R)-3,3-dimethyl-2-(3-methylbut-3-enyl)cyclobutyl)hepta-2,6-dienamide (11c)
TypeSmall organic molecule
Emp. Form.C20H32ClNO
Mol. Mass.337.927
SMILESCC(=C)CC[C@@H]1[C@@H](CC1(C)C)C(=C)CC\C=C\C(=O)NCCCl