Reaction Details
TargetFatty-acid amide hydrolase 1
LigandBDBM113764
Substrate/Competitorn/a
Meas. Tech.FAAH Activity Assay
pH7.6±n/a
Temperature310.15±n/a K
IC50 6.3e+3± 1.5e+3 nM
Commentsextracted
Citation Chicca, ACaprioglio, DMinassi, APetrucci, VAppendino, GTaglialatela-Scafati, OGertsch, J Functionalization of ß-Caryophyllene Generates Novel Polypharmacology in the Endocannabinoid System. ACS Chem Biol9:1499-507 (2014) 
 
Fatty-acid amide hydrolase 1
Name:Fatty-acid amide hydrolase 1
Type:Protein
Mol. Mass.:63071.19
Organism:Homo sapiens (Human)
Description:O00519
Residue:579
BDBM113764
NameBDBM113764
Synonyms:(E)-6-((1R,2R)-3,3-Dimethyl-2-(3-methylbut-3-enyl)cyclobutyl)-N-propylhepta-2,6-dienamide (11a)
TypeSmall organic molecule
Emp. Form.C21H35NO
Mol. Mass.317.5087
SMILESCCCNC(=O)\C=C\CCC(=C)[C@@H]1CC(C)(C)[C@@H]1CCC(C)=C