Reaction Details
TargetProstaglandin G/H synthase 2
LigandBDBM113763
Substrate/Competitorn/a
Meas. Tech.COX-2 Activity Assay
pH8±n/a
Temperature298.15±n/a K
IC50>5.0e+4±n/a nM
Commentsextracted
Citation Chicca, ACaprioglio, DMinassi, APetrucci, VAppendino, GTaglialatela-Scafati, OGertsch, J Functionalization of ß-Caryophyllene Generates Novel Polypharmacology in the Endocannabinoid System. ACS Chem Biol9:1499-507 (2014) 
 
Prostaglandin G/H synthase 2
Name:Prostaglandin G/H synthase 2
Type:Enzyme
Mol. Mass.:69003.89
Organism:Homo sapiens (Human)
Description:Recombinant Cox-2 provided by Cayman (Cayman Chemical Co.,Ann Arbor, MI).
Residue:604
BDBM113763
NameBDBM113763
Synonyms:β-Caryophyllene (1) (−)-trans-caryophyllene
TypeSmall organic molecule
Emp. Form.C15H24
Mol. Mass.204.3511
SMILESC\C1=C/CCC(=C)[C@@H]2CC(C)(C)[C@@H]2CC1