Reaction Details
TargetProstaglandin G/H synthase 2
LigandBDBM113768
Substrate/Competitorn/a
Meas. Tech.COX-2 Activity Assay
pH8±n/a
Temperature298.15±n/a K
IC50 8.9e+3± 2.9e+3 nM
Commentsextracted
Citation Chicca, ACaprioglio, DMinassi, APetrucci, VAppendino, GTaglialatela-Scafati, OGertsch, J Functionalization of ß-Caryophyllene Generates Novel Polypharmacology in the Endocannabinoid System. ACS Chem Biol9:1499-507 (2014) 
 
Prostaglandin G/H synthase 2
Name:Prostaglandin G/H synthase 2
Type:Enzyme
Mol. Mass.:69003.89
Organism:Homo sapiens (Human)
Description:Recombinant Cox-2 provided by Cayman (Cayman Chemical Co.,Ann Arbor, MI).
Residue:604
BDBM113768
NameBDBM113768
Synonyms:(E)-N-(3,4-Dihydroxyphenethyl)-6-((1R,2R)-3,3-dimethyl-2-(3-methylbut-3-enyl)cyclobutyl)hepta-2,6-dienamide (11f)
TypeSmall organic molecule
Emp. Form.C26H37NO3
Mol. Mass.411.5769
SMILESCC(=C)CC[C@@H]1[C@@H](CC1(C)C)C(=C)CC\C=C\C(=O)NCCc1ccc(O)c(O)c1