Reaction Details
TargetProstaglandin G/H synthase 2
LigandBDBM113766
Substrate/Competitorn/a
Meas. Tech.COX-2 Activity Assay
pH8±n/a
Temperature298.15±n/a K
IC50>5.0e+4±n/a nM
Commentsextracted
Citation Chicca, ACaprioglio, DMinassi, APetrucci, VAppendino, GTaglialatela-Scafati, OGertsch, J Functionalization of ß-Caryophyllene Generates Novel Polypharmacology in the Endocannabinoid System. ACS Chem Biol9:1499-507 (2014) 
 
Prostaglandin G/H synthase 2
Name:Prostaglandin G/H synthase 2
Type:Enzyme
Mol. Mass.:69003.89
Organism:Homo sapiens (Human)
Description:Recombinant Cox-2 provided by Cayman (Cayman Chemical Co.,Ann Arbor, MI).
Residue:604
BDBM113766
NameBDBM113766
Synonyms:(E)-N-(2-Chloroethyl)-6-((1R,2R)-3,3-dimethyl-2-(3-methylbut-3-enyl)cyclobutyl)hepta-2,6-dienamide (11c)
TypeSmall organic molecule
Emp. Form.C20H32ClNO
Mol. Mass.337.927
SMILESCC(=C)CC[C@@H]1[C@@H](CC1(C)C)C(=C)CC\C=C\C(=O)NCCCl