Reaction Details
TargetProstaglandin G/H synthase 2
LigandBDBM113767
Substrate/Competitorn/a
Meas. Tech.COX-2 Activity Assay
pH8±n/a
Temperature298.15±n/a K
IC50 2.2e+3± 1.2e+3 nM
Commentsextracted
Citation Chicca, ACaprioglio, DMinassi, APetrucci, VAppendino, GTaglialatela-Scafati, OGertsch, J Functionalization of ß-Caryophyllene Generates Novel Polypharmacology in the Endocannabinoid System. ACS Chem Biol9:1499-507 (2014) 
 
Prostaglandin G/H synthase 2
Name:Prostaglandin G/H synthase 2
Type:Enzyme
Mol. Mass.:69003.89
Organism:Homo sapiens (Human)
Description:Recombinant Cox-2 provided by Cayman (Cayman Chemical Co.,Ann Arbor, MI).
Residue:604
BDBM113767
NameBDBM113767
Synonyms:(E)-6-((1R,2R)-3,3-Dimethyl-2-(3-methylbut-3-enyl)cyclobutyl)-N-(4-hydroxy-3-methoxybenzyl)hepta-2,6-dienamide (11e)
TypeSmall organic molecule
Emp. Form.C26H37NO3
Mol. Mass.411.5769
SMILESCOc1cc(CNC(=O)\C=C\CCC(=C)[C@@H]2CC(C)(C)[C@@H]2CCC(C)=C)ccc1O