Reaction Details
TargetAcyl-homoserine lactone acylase PvdQ [A190E,F674L]
LigandBDBM113772
Substrate/Competitorn/a
Meas. Tech.PvdQ IC50 Assay
IC50 2e+1± 1e+1 nM
Citation Wurst, JMDrake, EJTheriault, JRJewett, ITVerPlank, LPerez, JRDandapani, SPalmer, MMoskowitz, SMSchreiber, SLMunoz, BGulick, AM Identification of Inhibitors of PvdQ, an Enzyme Involved in the Synthesis of the Siderophore Pyoverdine. ACS Chem Biol9:1536-44 (2014) 
 
Acyl-homoserine lactone acylase PvdQ [A190E,F674L]
Name:Acyl-homoserine lactone acylase PvdQ [A190E,F674L]
Type:Protein
Mol. Mass.:84038.62
Organism:Pseudomonas aeruginosa
Description:Ntn hydrolase
Residue:762
BDBM113772
NameBDBM113772
Synonyms:2-(4-Fluorophenyl)-2-(6-(trifluoromethyl)pyridin-2-yl) acetonitrile (4)
TypeSmall organic molecule
Emp. Form.C14H8F4N2
Mol. Mass.280.2203
SMILESFc1ccc(cc1)C(C#N)c1cccc(n1)C(F)(F)F