Reaction Details
TargetAcyl-homoserine lactone acylase PvdQ [A190E,F674L]
LigandBDBM113782
Substrate/Competitorn/a
Meas. Tech.PvdQ IC50 Assay
IC50 1.3e+2± 4e+1 nM
Citation Wurst, JMDrake, EJTheriault, JRJewett, ITVerPlank, LPerez, JRDandapani, SPalmer, MMoskowitz, SMSchreiber, SLMunoz, BGulick, AM Identification of Inhibitors of PvdQ, an Enzyme Involved in the Synthesis of the Siderophore Pyoverdine. ACS Chem Biol9:1536-44 (2014) 
 
Acyl-homoserine lactone acylase PvdQ [A190E,F674L]
Name:Acyl-homoserine lactone acylase PvdQ [A190E,F674L]
Type:Protein
Mol. Mass.:84038.62
Organism:Pseudomonas aeruginosa
Description:Ntn hydrolase
Residue:762
BDBM113782
NameBDBM113782
Synonyms:2-(4-Chlorophenyl)-2-(5-chloropyridin-2-yl) acetonitrile (14)
TypeSmall organic molecule
Emp. Form.C13H8Cl2N2
Mol. Mass.263.122
SMILESClc1ccc(cc1)C(C#N)c1ccc(Cl)cn1