Reaction Details
Target1-phosphatidylinositol 4,5-bisphosphate phosphodiesterase beta-3
LigandBDBM33185
Substrate/Competitorn/a
Meas. Tech.Fluorescence-based biochemical high throughput dose response assay to identify inhibitors of phospholipase C isozymes (PLC-B3)
IC50 122448±n/a nM
Citation PubChem, PC Fluorescence-based biochemical high throughput dose response assay to identify inhibitors of phospholipase C isozymes (PLC-B3) PubChem Bioassay(2014)[AID]
 
1-phosphatidylinositol 4,5-bisphosphate phosphodiesterase beta-3
Name:1-phosphatidylinositol 4,5-bisphosphate phosphodiesterase beta-3
Type:PROTEIN
Mol. Mass.:138786.29
Organism:Homo sapiens (Human)
Description:EBI_12586
Residue:1234
BDBM33185
NameBDBM33185
Synonyms:4-({(4Z)-1-oxo-4-[(phenylsulfonyl)imino]-1,4-dihydronaphthalen-2-yl}amino)benzoic acid 4-[[(4Z)-4-besylimino-1-keto-2-naphthyl]amino]benzoic acid 4-[[4-(benzenesulfonylimino)-1-oxo-2-naphthalenyl]amino]benzoic acid MLS000686314 cid_4053104
TypeSmall organic molecule
Emp. Form.C23H16N2O5S
Mol. Mass.432.449
SMILESOC(=O)c1ccc(NC2=CC(=NS(=O)(=O)c3ccccc3)c3ccccc3C2=O)cc1