Reaction Details
TargetMajor prion protein
LigandBDBM40943
Substrate/Competitorn/a
Meas. Tech.TRFRET-based cell-based high throughput dose response assay to identify inhibitors of cell surface Prion Protein (PRPC)
IC50 910±n/a nM
Citation PubChem, PC TRFRET-based cell-based high throughput dose response assay to identify inhibitors of cell surface Prion Protein (PRPC) PubChem Bioassay(2014)[AID]
 
Major prion protein
Name:Major prion protein
Type:PROTEIN
Mol. Mass.:27671.97
Organism:Homo sapiens (Human)
Description:ChEMBL_158887
Residue:253
BDBM40943
NameBDBM40943
Synonyms:(2-Isopropyl-quinazolin-4-ylsulfanyl)-acetic acid methyl ester 2-[(2-propan-2-yl-4-quinazolinyl)thio]acetic acid methyl ester SMR000006837 methyl 2-(2-propan-2-ylquinazolin-4-yl)sulfanylacetate | methyl 2-(2-propan-2-ylquinazolin-4-yl)sulfanylethanoate
TypeSmall organic molecule
Emp. Form.C14H16N2O2S
Mol. Mass.276.354
SMILESCOC(=O)CSc1nc(nc2ccccc12)C(C)C