Reaction Details
TargetMajor prion protein
LigandBDBM42605
Substrate/Competitorn/a
Meas. Tech.TRFRET-based cell-based high throughput dose response assay to identify inhibitors of cell surface Prion Protein (PRPC)
IC50 1005±n/a nM
Citation PubChem, PC TRFRET-based cell-based high throughput dose response assay to identify inhibitors of cell surface Prion Protein (PRPC) PubChem Bioassay(2014)[AID]
 
Major prion protein
Name:Major prion protein
Type:PROTEIN
Mol. Mass.:27671.97
Organism:Homo sapiens (Human)
Description:ChEMBL_158887
Residue:253
BDBM42605
NameBDBM42605
Synonyms:MLS000073796 N-(5-methyl-1,2-oxazol-3-yl)-2-(2-propylquinazolin-4-yl)sulfanyl-ethanamide N-(5-methyl-3-isoxazolyl)-2-[(2-propyl-4-quinazolinyl)thio]acetamide SMR000006835 | cid_653552
TypeSmall organic molecule
Emp. Form.C17H18N4O2S
Mol. Mass.342.415
SMILESCCCc1nc(SCC(=O)Nc2cc(C)on2)c2ccccc2n1