Reaction Details
TargetMajor prion protein
LigandBDBM42635
Substrate/Competitorn/a
Meas. Tech.TRFRET-based cell-based high throughput dose response assay to identify inhibitors of cell surface Prion Protein (PRPC)
IC50 1558±n/a nM
Citation PubChem, PC TRFRET-based cell-based high throughput dose response assay to identify inhibitors of cell surface Prion Protein (PRPC) PubChem Bioassay(2014)[AID]
 
Major prion protein
Name:Major prion protein
Type:PROTEIN
Mol. Mass.:27671.97
Organism:Homo sapiens (Human)
Description:ChEMBL_158887
Residue:253
BDBM42635
NameBDBM42635
Synonyms:2-(2-quinolinylthio)propanoic acid 2-quinolin-2-ylsulfanylpropanoic acid SMR000042099 | cid_661441
TypeSmall organic molecule
Emp. Form.C12H11NO2S
Mol. Mass.233.286
SMILESCC(Sc1ccc2ccccc2n1)C(O)=O