Reaction Details
TargetMajor prion protein
LigandBDBM42714
Substrate/Competitorn/a
Meas. Tech.TRFRET-based cell-based high throughput dose response assay to identify inhibitors of cell surface Prion Protein (PRPC)
IC50 1691±n/a nM
Citation PubChem, PC TRFRET-based cell-based high throughput dose response assay to identify inhibitors of cell surface Prion Protein (PRPC) PubChem Bioassay(2014)[AID]
 
Major prion protein
Name:Major prion protein
Type:PROTEIN
Mol. Mass.:27671.97
Organism:Homo sapiens (Human)
Description:ChEMBL_158887
Residue:253
BDBM42714
NameBDBM42714
Synonyms:MLS000089894 N-(3-chlorophenyl)-2-[[5-cyano-6-(2-furyl)-4-keto-1H-pyrimidin-2-yl]thio]acetamide N-(3-chlorophenyl)-2-[[5-cyano-6-(furan-2-yl)-4-oxo-1H-pyrimidin-2-yl]sulfanyl]acetamide SMR000024512 | cid_3240275
TypeSmall organic molecule
Emp. Form.C17H11ClN4O3S
Mol. Mass.386.812
SMILESClc1cccc(NC(=O)CSc2nc(-c3ccco3)c(C#N)c(=O)[nH]2)c1