Reaction Details
TargetMajor prion protein
LigandBDBM42858
Substrate/Competitorn/a
Meas. Tech.TRFRET-based cell-based high throughput dose response assay to identify inhibitors of cell surface Prion Protein (PRPC)
IC50 915±n/a nM
Citation PubChem, PC TRFRET-based cell-based high throughput dose response assay to identify inhibitors of cell surface Prion Protein (PRPC) PubChem Bioassay(2014)[AID]
 
Major prion protein
Name:Major prion protein
Type:PROTEIN
Mol. Mass.:27671.97
Organism:Homo sapiens (Human)
Description:ChEMBL_158887
Residue:253
BDBM42858
NameBDBM42858
Synonyms:3-(2-methylquinazolin-4-yl)sulfanylpropanoic acid 3-[(2-methylquinazolin-4-yl)thio]propionic acid SMR000108535 | cid_588806
TypeSmall organic molecule
Emp. Form.C12H12N2O2S
Mol. Mass.248.301
SMILESCc1nc(SCCC(O)=O)c2ccccc2n1