Reaction Details
TargetMajor prion protein
LigandBDBM114319
Substrate/Competitorn/a
Meas. Tech.TRFRET-based cell-based high throughput dose response assay to identify inhibitors of cell surface Prion Protein (PRPC)
IC50 1876±n/a nM
Citation PubChem, PC TRFRET-based cell-based high throughput dose response assay to identify inhibitors of cell surface Prion Protein (PRPC) PubChem Bioassay(2014)[AID]
 
Major prion protein
Name:Major prion protein
Type:PROTEIN
Mol. Mass.:27671.97
Organism:Homo sapiens (Human)
Description:ChEMBL_158887
Residue:253
BDBM114319
NameBDBM114319
Synonyms:MLS000555430 Sodium; 2-(quinolin-2-ylsulfanyl)-propionate sodium;2-(2-quinolinylthio)propanoate sodium;2-quinolin-2-ylsulfanylpropanoate
TypeSmall organic molecule
Emp. Form.C12H10NO2S
Mol. Mass.232.279
SMILESCC(Sc1ccc2ccccc2n1)C([O-])=O