Reaction Details
TargetMajor prion protein
LigandBDBM114379
Substrate/Competitorn/a
Meas. Tech.TRFRET-based cell-based high throughput dose response assay to identify inhibitors of cell surface Prion Protein (PRPC)
IC50 1312±n/a nM
Citation PubChem, PC TRFRET-based cell-based high throughput dose response assay to identify inhibitors of cell surface Prion Protein (PRPC) PubChem Bioassay(2014)[AID]
 
Major prion protein
Name:Major prion protein
Type:PROTEIN
Mol. Mass.:27671.97
Organism:Homo sapiens (Human)
Description:ChEMBL_158887
Residue:253
BDBM114379
NameBDBM114379
Synonyms:2-[(2-phenyl-4-quinazolinyl)thio]acetic acid methyl ester MLS000688435 cid_865071 methyl 2-(2-phenylquinazolin-4-yl)sulfanylethanoate
TypeSmall organic molecule
Emp. Form.C17H14N2O2S
Mol. Mass.310.37
SMILESCOC(=O)CSc1nc(nc2ccccc12)-c1ccccc1