Reaction Details
TargetMajor prion protein
LigandBDBM114384
Substrate/Competitorn/a
Meas. Tech.TRFRET-based cell-based high throughput dose response assay to identify inhibitors of cell surface Prion Protein (PRPC)
IC50 1835±n/a nM
Citation PubChem, PC TRFRET-based cell-based high throughput dose response assay to identify inhibitors of cell surface Prion Protein (PRPC) PubChem Bioassay(2014)[AID]
 
Major prion protein
Name:Major prion protein
Type:PROTEIN
Mol. Mass.:27671.97
Organism:Homo sapiens (Human)
Description:ChEMBL_158887
Residue:253
BDBM114384
NameBDBM114384
Synonyms:2-[(2-phenyl-4-quinazolinyl)thio]propanoic acid ethyl ester MLS000687054 cid_3167727 | ethyl 2-(2-phenylquinazolin-4-yl)sulfanylpropanoate
TypeSmall organic molecule
Emp. Form.C19H18N2O2S
Mol. Mass.338.423
SMILESCCOC(=O)C(C)Sc1nc(nc2ccccc12)-c1ccccc1