Reaction Details
TargetMajor prion protein
LigandBDBM53214
Substrate/Competitorn/a
Meas. Tech.TRFRET-based cell-based high throughput dose response assay to identify inhibitors of cell surface Prion Protein (PRPC)
IC50 1703±n/a nM
Citation PubChem, PC TRFRET-based cell-based high throughput dose response assay to identify inhibitors of cell surface Prion Protein (PRPC) PubChem Bioassay(2014)[AID]
 
Major prion protein
Name:Major prion protein
Type:PROTEIN
Mol. Mass.:27671.97
Organism:Homo sapiens (Human)
Description:ChEMBL_158887
Residue:253
BDBM53214
NameBDBM53214
Synonyms:2,5-dihydro-[1,2,4]triazolo[4,3-a]quinoxaline-1,4-dithione SMR000560114 cid_5300057
TypeSmall organic molecule
Emp. Form.C9H6N4S2
Mol. Mass.234.301
SMILESS=c1[nH]nc2n1c1ccccc1[nH]c2=S