Reaction Details
TargetMajor prion protein
LigandBDBM114447
Substrate/Competitorn/a
Meas. Tech.TRFRET-based cell-based high throughput dose response assay to identify inhibitors of cell surface Prion Protein (PRPC)
IC50 1571±n/a nM
Citation PubChem, PC TRFRET-based cell-based high throughput dose response assay to identify inhibitors of cell surface Prion Protein (PRPC) PubChem Bioassay(2014)[AID]
 
Major prion protein
Name:Major prion protein
Type:PROTEIN
Mol. Mass.:27671.97
Organism:Homo sapiens (Human)
Description:ChEMBL_158887
Residue:253
BDBM114447
NameBDBM114447
Synonyms:2-(5-bromanylnaphthalen-1-yl)carbonylbenzoic acid 2-(5-bromonaphthalene-1-carbonyl)benzoic acid MLS002639261 cid_232079
TypeSmall organic molecule
Emp. Form.C18H11BrO3
Mol. Mass.355.182
SMILESOC(=O)c1ccccc1C(=O)c1cccc2c(Br)cccc12