Reaction Details
TargetGroup 3 secretory phospholipase A2
LigandBDBM67690
Substrate/Competitorn/a
Meas. Tech.QFRET-based biochemical high throughput dose response assay to identify inhibitors of human group III secreted phospholipase A2 enzyme (HGIII-sPLA2)
IC50 121843±n/a nM
Citation PubChem, PC QFRET-based biochemical high throughput dose response assay to identify inhibitors of human group III secreted phospholipase A2 enzyme (HGIII-sPLA2) PubChem Bioassay(2014)[AID]
 
Group 3 secretory phospholipase A2
Name:Group 3 secretory phospholipase A2
Type:PROTEIN
Mol. Mass.:57196.58
Organism:Homo sapiens
Description:ChEMBL_119722
Residue:509
BDBM67690
NameBDBM67690
Synonyms:1,4-bis[2-(2-hydroxyethylamino)ethylamino]-5,8-bis(oxidanyl)anthracene-9,10-dione;hydrochloride 1,4-dihydroxy-5,8-bis[2-(2-hydroxyethylamino)ethylamino]anthracene-9,10-dione;hydrochloride MITOXANTRONE MLS001333711 cid_4212 | cid_5458171
TypeSmall organic molecule
Emp. Form.C22H28N4O6
Mol. Mass.444.4809
SMILESOCCNCCNc1ccc(NCCNCCO)c2C(=O)c3c(O)ccc(O)c3C(=O)c12