Reaction Details
TargetMethyl-CpG-binding domain protein 2
LigandBDBM114640
Substrate/Competitorn/a
Meas. Tech.TRFRET-based biochemical high throughput dose response assay to identify inhibitors of 5-meCpG-binding domain protein 2 (MBD2)-DBD binding to methylated oligonucleotide
IC50 10248±n/a nM
Citation PubChem, PC TRFRET-based biochemical high throughput dose response assay to identify inhibitors of 5-meCpG-binding domain protein 2 (MBD2)-DBD binding to methylated oligonucleotide PubChem Bioassay(2013)[AID]
 
Methyl-CpG-binding domain protein 2
Name:Methyl-CpG-binding domain protein 2
Type:Enzyme Catalytic Domain
Mol. Mass.:43278.74
Organism:Homo sapiens (Human)
Description:gi_21595776
Residue:411
BDBM114640
NameBDBM114640
Synonyms:2-[2,4-diphenyl-6-(p-tolyl)pyridin-1-ium-1-yl]benzoic acid;perchlorate 2-[2-(4-methylphenyl)-4,6-diphenyl-pyridin-1-ium-1-yl]benzoic acid;perchlorate MLS001240936 cid_12627139
TypeSmall organic molecule
Emp. Form.C31H24NO2
Mol. Mass.442.5272
SMILESCc1ccc(cc1)-c1cc(cc(-c2ccccc2)[n+]1-c1ccccc1C(O)=O)-c1ccccc1