Reaction Details
TargetMethyl-CpG-binding domain protein 2
LigandBDBM114645
Substrate/Competitorn/a
Meas. Tech.TRFRET-based biochemical high throughput dose response assay to identify inhibitors of 5-meCpG-binding domain protein 2 (MBD2)-DBD binding to methylated oligonucleotide
IC50 9435±n/a nM
Citation PubChem, PC TRFRET-based biochemical high throughput dose response assay to identify inhibitors of 5-meCpG-binding domain protein 2 (MBD2)-DBD binding to methylated oligonucleotide PubChem Bioassay(2013)[AID]
 
Methyl-CpG-binding domain protein 2
Name:Methyl-CpG-binding domain protein 2
Type:Enzyme Catalytic Domain
Mol. Mass.:43278.74
Organism:Homo sapiens (Human)
Description:gi_21595776
Residue:411
BDBM114645
NameBDBM114645
Synonyms:1-[2-(dimethylamino)ethylamino]-4-methyl-7-oxidanyl-thioxanthen-9-one 1-[2-(dimethylamino)ethylamino]-7-hydroxy-4-methyl-thioxanthen-9-one MLS002701807 cid_432873
TypeSmall organic molecule
Emp. Form.C18H20N2O2S
Mol. Mass.328.429
SMILESCN(C)CCNc1ccc(C)c2sc3ccc(O)cc3c(=O)c12