Reaction Details
TargetMethyl-CpG-binding domain protein 2
LigandBDBM89488
Substrate/Competitorn/a
Meas. Tech.TRFRET-based biochemical high throughput dose response assay to identify inhibitors of 5-meCpG-binding domain protein 2 (MBD2)-DBD binding to methylated oligonucleotide
IC50 8206±n/a nM
Citation PubChem, PC TRFRET-based biochemical high throughput dose response assay to identify inhibitors of 5-meCpG-binding domain protein 2 (MBD2)-DBD binding to methylated oligonucleotide PubChem Bioassay(2013)[AID]
 
Methyl-CpG-binding domain protein 2
Name:Methyl-CpG-binding domain protein 2
Type:Enzyme Catalytic Domain
Mol. Mass.:43278.74
Organism:Homo sapiens (Human)
Description:gi_21595776
Residue:411
BDBM89488
NameBDBM89488
Synonyms:MLS002702308 N-[2-(dimethylamino)ethyl]-8-methoxy-acridine-4-carboxamide;hydrochloride SMR001565870 | cid_386511
TypeSmall organic molecule
Emp. Form.C19H21N3O2
Mol. Mass.323.3889
SMILESCOc1cccc2nc3c(cccc3cc12)C(=O)NCCN(C)C