Reaction Details
TargetFibrinogen beta chain [164-491]
LigandBDBM32108
Substrate/Competitorn/a
Meas. Tech.Fluorescence polarization-based biochemical high throughput dose response assay to identify inhibitors that disrupt the binding of a cyclic peptide (Tn6) to the fibrin proteolytic product D-Dimer
IC50 17891±n/a nM
Citation PubChem, PC Fluorescence polarization-based biochemical high throughput dose response assay to identify inhibitors that disrupt the binding of a cyclic peptide (Tn6) to the fibrin proteolytic product D-Dimer and fragment E complex [DD(E )] PubChem Bioassay(2013)[AID]
 
Fibrinogen beta chain [164-491]
Name:Fibrinogen beta chain [164-491]
Type:Enzyme Catalytic Domain
Mol. Mass.:37647.12
Organism:Homo sapiens (Human)
Description:gi_28373962
Residue:328
BDBM32108
NameBDBM32108
Synonyms:6-keto-7,8,9,10-tetrahydrophenothiazine-3-carboxylic acid methyl ester MLS000100349 cid_1258835 methyl 6-oxidanylidene-7,8,9,10-tetrahydrophenothiazine-3-carboxylate | methyl 6-oxo-7,8,9,10-tetrahydrophenothiazine-3-carboxylate
TypeSmall organic molecule
Emp. Form.C14H13NO3S
Mol. Mass.275.323
SMILESCOC(=O)c1ccc2N=C3CCCC(=O)C3Sc2c1