Reaction Details
TargetFibrinogen beta chain [164-491]
LigandBDBM114654
Substrate/Competitorn/a
Meas. Tech.Fluorescence polarization-based biochemical high throughput dose response assay to identify inhibitors that disrupt the binding of a cyclic peptide (Tn7) to the fibrin proteolytic product D-Dimer
IC50 27761±n/a nM
Citation PubChem, PC Fluorescence polarization-based biochemical high throughput dose response assay to identify inhibitors that disrupt the binding of a cyclic peptide (Tn7) to the fibrin proteolytic product D-Dimer and fragment E complex [DD(E )] PubChem Bioassay(2013)[AID]
 
Fibrinogen beta chain [164-491]
Name:Fibrinogen beta chain [164-491]
Type:Enzyme Catalytic Domain
Mol. Mass.:37647.12
Organism:Homo sapiens (Human)
Description:gi_28373962
Residue:328
BDBM114654
NameBDBM114654
Synonyms:4-[[3-(4-methylphenyl)-1,2,4-oxadiazol-5-yl]methyl]-1-piperazinecarboxylic acid ethyl ester MLS000063762 cid_752372 ethyl 4-{[3-(4-methylphenyl)-1,2,4-oxadiazol-5-yl]methyl}-1-piperazinecarboxylate
TypeSmall organic molecule
Emp. Form.C17H22N4O3
Mol. Mass.330.3816
SMILESCCOC(=O)N1CCN(Cc2nc(no2)-c2ccc(C)cc2)CC1