Reaction Details
TargetPotassium channel subfamily K member 3
LigandBDBM218618
Substrate/Competitorn/a
Meas. Tech.Activity Assay
Temperature298.15±n/a K
IC50 36±n/a nM
Commentsextracted
Citation Bialy, LLorenz, KWirth, KSteinmeyer, KHessler, G Fused pyrroledicarboxamides and their use as pharmaceuticals US Patent US9884860 Publication Date 2/6/2018
 
Potassium channel subfamily K member 3
Name:Potassium channel subfamily K member 3
Type:Protein
Mol. Mass.:43534.71
Organism:Homo sapiens (Human)
Description:O14649
Residue:394
BDBM218618
NameBDBM218618
Synonyms:US9284333, 16gk | US9884860, Example 16gk
TypeSmall organic molecule
Emp. Form.C23H29N3O3
Mol. Mass.395.4947
SMILESCC[C@@H](NC(=O)c1cc(C(=O)NCCC2CC2)n2CCOCc12)c1ccccc1