Reaction Details
TargetPotassium channel subfamily K member 3
LigandBDBM218535
Substrate/Competitorn/a
Meas. Tech.Activity Assay
Temperature298.15±n/a K
IC50 27±n/a nM
Commentsextracted
Citation Bialy, LLorenz, KWirth, KSteinmeyer, KHessler, G Fused pyrroledicarboxamides and their use as pharmaceuticals US Patent US9884860 Publication Date 2/6/2018
 
Potassium channel subfamily K member 3
Name:Potassium channel subfamily K member 3
Type:Protein
Mol. Mass.:43534.71
Organism:Homo sapiens (Human)
Description:O14649
Residue:394
BDBM218535
NameBDBM218535
Synonyms:US9284333, 16kt | US9884860, Example 16kt
TypeSmall organic molecule
Emp. Form.C25H26FN3O2S
Mol. Mass.451.556
SMILESCC[C@@H](NC(=O)c1cc(C(=O)N[C@H](C)c2ccc(F)cc2)n2CCSc12)c1ccccc1