Reaction Details
TargetPC4 and SFRS1-interacting protein
LigandBDBM34840
Substrate/Competitorn/a
Meas. Tech.Counterscreen for inhibitors of LEDGF/p75-dependent integration: TR-FRET-based biochemical high throughput dose response counterscreen assay to identify activators of HIV-1 Integrase multimerization
IC50 563.94±n/a nM
Citation PubChem, PC Counterscreen for inhibitors of LEDGF/p75-dependent integration: TR-FRET-based biochemical high throughput dose response counterscreen assay to identify activators of HIV-1 Integrase multimerization PubChem Bioassay(2014)[AID]
 
PC4 and SFRS1-interacting protein
Name:PC4 and SFRS1-interacting protein
Type:Enzyme Catalytic Domain
Mol. Mass.:60120.68
Organism:Homo sapiens (Human)
Description:gi_6708281
Residue:530
BDBM34840
NameBDBM34840
Synonyms:MLS000393172 N'-[(E)-(2,3-dihydroxy-4-oxo-1-cyclohexa-2,5-dienylidene)methyl]-1-ethyl-2-methyl-5-benzimidazolecarbohydrazide N'-[(E)-[2,3-bis(oxidanyl)-4-oxidanylidene-cyclohexa-2,5-dien-1-ylidene]methyl]-1-ethyl-2-methyl-benzimidazole-5-carbohydrazide cid_6089713
TypeSmall organic molecule
Emp. Form.C18H18N4O4
Mol. Mass.354.3599
SMILESCCn1c(C)nc2cc(ccc12)C(=O)NN=Cc1ccc(O)c(O)c1O