Reaction Details
TargetPC4 and SFRS1-interacting protein
LigandBDBM46590
Substrate/Competitorn/a
Meas. Tech.Counterscreen for inhibitors of LEDGF/p75-dependent integration: TR-FRET-based biochemical high throughput dose response counterscreen assay to identify activators of HIV-1 Integrase multimerization
IC50 3401±n/a nM
Citation PubChem, PC Counterscreen for inhibitors of LEDGF/p75-dependent integration: TR-FRET-based biochemical high throughput dose response counterscreen assay to identify activators of HIV-1 Integrase multimerization PubChem Bioassay(2014)[AID]
 
PC4 and SFRS1-interacting protein
Name:PC4 and SFRS1-interacting protein
Type:Enzyme Catalytic Domain
Mol. Mass.:60120.68
Organism:Homo sapiens (Human)
Description:gi_6708281
Residue:530
BDBM46590
NameBDBM46590
Synonyms:4-[2-[(E)-(2,3-dihydroxy-4-oxocyclohexa-2,5-dien-1-ylidene)methyl]hydrazinyl]-3-nitrobenzenesulfonamide 4-[N'-[(E)-(2,3-dihydroxy-4-keto-cyclohexa-2,5-dien-1-ylidene)methyl]hydrazino]-3-nitro-benzenesulfonamide MLS000759826 cid_5982653
TypeSmall organic molecule
Emp. Form.C13H12N4O7S
Mol. Mass.368.322
SMILESNS(=O)(=O)c1ccc(N=[NH+]Cc2ccc([O-])c(O)c2O)c(c1)[N+]([O-])=O