Reaction Details
TargetPC4 and SFRS1-interacting protein
LigandBDBM49124
Substrate/Competitorn/a
Meas. Tech.Counterscreen for inhibitors of LEDGF/p75-dependent integration: TR-FRET-based biochemical high throughput dose response counterscreen assay to identify activators of HIV-1 Integrase multimerization
IC50 53715±n/a nM
Citation PubChem, PC Counterscreen for inhibitors of LEDGF/p75-dependent integration: TR-FRET-based biochemical high throughput dose response counterscreen assay to identify activators of HIV-1 Integrase multimerization PubChem Bioassay(2014)[AID]
 
PC4 and SFRS1-interacting protein
Name:PC4 and SFRS1-interacting protein
Type:Enzyme Catalytic Domain
Mol. Mass.:60120.68
Organism:Homo sapiens (Human)
Description:gi_6708281
Residue:530
BDBM49124
NameBDBM49124
Synonyms:MLS000082574 cid_665142
TypeSmall organic molecule
Emp. Form.C21H22N4O3S2
Mol. Mass.442.554
SMILESCSc1nc(N(CCO)CCO)c2sc3nc(-c4ccco4)c4CCCc4c3c2n1