Reaction Details
TargetPC4 and SFRS1-interacting protein
LigandBDBM33090
Substrate/Competitorn/a
Meas. Tech.TR-FRET-based biochemical high throughput dose response assay to identify inhibitors of HIV-1 LEDGF/p75 DNA Integration
IC50 5611±n/a nM
Citation PubChem, PC TR-FRET-based biochemical high throughput dose response assay to identify inhibitors of HIV-1 LEDGF/p75 DNA Integration PubChem Bioassay(2014)[AID]
 
PC4 and SFRS1-interacting protein
Name:PC4 and SFRS1-interacting protein
Type:Enzyme Catalytic Domain
Mol. Mass.:60120.68
Organism:Homo sapiens (Human)
Description:gi_6708281
Residue:530
BDBM33090
NameBDBM33090
Synonyms:(4E)-4-[[(2-ethylimino-4-methyl-1,3-thiazol-3-yl)amino]methylidene]-2,3-bis(oxidanyl)cyclohexa-2,5-dien-1-one (4E)-4-[[(2-ethylimino-4-methyl-3-thiazolyl)amino]methylidene]-2,3-dihydroxy-1-cyclohexa-2,5-dienone (4Z)-4-[[(2-ethylimino-4-methyl-4-thiazolin-3-yl)amino]methylene]-2,3-dihydroxy-cyclohexa-2,5-dien-1-one SMR000151702 | cid_5825518
TypeSmall organic molecule
Emp. Form.C13H15N3O3S
Mol. Mass.293.342
SMILESCCN=c1scc(C)n1N=Cc1ccc(O)c(O)c1O