Reaction Details
TargetPC4 and SFRS1-interacting protein
LigandBDBM34972
Substrate/Competitorn/a
Meas. Tech.TR-FRET-based biochemical high throughput dose response assay to identify inhibitors of HIV-1 LEDGF/p75 DNA Integration
IC50 927±n/a nM
Citation PubChem, PC TR-FRET-based biochemical high throughput dose response assay to identify inhibitors of HIV-1 LEDGF/p75 DNA Integration PubChem Bioassay(2014)[AID]
 
PC4 and SFRS1-interacting protein
Name:PC4 and SFRS1-interacting protein
Type:Enzyme Catalytic Domain
Mol. Mass.:60120.68
Organism:Homo sapiens (Human)
Description:gi_6708281
Residue:530
BDBM34972
NameBDBM34972
Synonyms:MLS000759648 N''-[(E)-(2,3-dihydroxy-4-oxocyclohexa-2,5-dien-1-ylidene)methyl]-2-(2-morpholin-4-yl-1,3-thiazol-4-yl)acetohydrazide N''-[(Z)-(2,3-dihydroxy-4-keto-cyclohexa-2,5-dien-1-ylidene)methyl]-2-(2-morpholinothiazol-4-yl)acetohydrazide N'-[(Z)-(2,3-dihydroxy-4-keto-cyclohexa-2,5-dien-1-ylidene)methyl]-2-(2-morpholinothiazol-4-yl)acetohydrazide cid_6508305
TypeSmall organic molecule
Emp. Form.C16H18N4O5S
Mol. Mass.378.403
SMILESOc1ccc(C=NNC(=O)Cc2csc(n2)N2CCOCC2)c(O)c1O