Reaction Details
TargetPC4 and SFRS1-interacting protein
LigandBDBM61867
Substrate/Competitorn/a
Meas. Tech.TR-FRET-based biochemical high throughput dose response assay to identify inhibitors of HIV-1 LEDGF/p75 DNA Integration
IC50 340.9±n/a nM
Citation PubChem, PC TR-FRET-based biochemical high throughput dose response assay to identify inhibitors of HIV-1 LEDGF/p75 DNA Integration PubChem Bioassay(2014)[AID]
 
PC4 and SFRS1-interacting protein
Name:PC4 and SFRS1-interacting protein
Type:Enzyme Catalytic Domain
Mol. Mass.:60120.68
Organism:Homo sapiens (Human)
Description:gi_6708281
Residue:530
BDBM61867
NameBDBM61867
Synonyms:2-(4-hydroxyphenyl)-5,6,7,8-tetrakis(oxidanyl)chromen-4-one 5,6,7,8-tetrahydroxy-2-(4-hydroxyphenyl)chromen-4-one MLS000736839 cid_96506
TypeSmall organic molecule
Emp. Form.C15H10O7
Mol. Mass.302.2357
SMILESOc1ccc(cc1)-c1cc(=O)c2c(O)c(O)c(O)c(O)c2o1