Reaction Details
TargetLysine-specific histone demethylase 1A
LigandBDBM50105417
Substrate/Competitorn/a
Meas. Tech.GST-LSD1 Enzymatic Assays
pH7.5±n/a
Ki 5.6e+3± 1.3e+3 nM
Commentsextracted
Citation Prusevich, PKalin, JHMing, SABasso, MGivens, JLi, XHu, JTaylor, MSCieniewicz, AMHsiao, PYHuang, RRoberson, HAdejola, NAvery, LBCasero, RATaverna, SDQian, JTackett, AJRatan, RRMcDonald, OGFeinberg, APCole, PA A Selective Phenelzine Analogue Inhibitor of Histone Demethylase LSD1. ACS Chem Biol9:1284-93 (2014) 
 
Lysine-specific histone demethylase 1A
Name:Lysine-specific histone demethylase 1A
Type:Enzyme
Mol. Mass.:92901.01
Organism:Homo sapiens (Human)
Description:O60341
Residue:852
BDBM50105417
NameBDBM50105417
Synonyms:CHEMBL1089 PHENELZINE | Phenethyl-hydrazine
TypeSmall organic molecule
Emp. Form.C8H12N2
Mol. Mass.136.1943
SMILESNNCCc1ccccc1