Reaction Details
TargetLysine-specific histone demethylase 1A
LigandBDBM113738
Substrate/Competitorn/a
Meas. Tech.GST-LSD1 Enzymatic Assays
pH7.5±n/a
IC50>1.000e+5±n/a nM
Commentsextracted
Citation Prusevich, PKalin, JHMing, SABasso, MGivens, JLi, XHu, JTaylor, MSCieniewicz, AMHsiao, PYHuang, RRoberson, HAdejola, NAvery, LBCasero, RATaverna, SDQian, JTackett, AJRatan, RRMcDonald, OGFeinberg, APCole, PA A Selective Phenelzine Analogue Inhibitor of Histone Demethylase LSD1. ACS Chem Biol9:1284-93 (2014) 
 
Lysine-specific histone demethylase 1A
Name:Lysine-specific histone demethylase 1A
Type:Enzyme
Mol. Mass.:92901.01
Organism:Homo sapiens (Human)
Description:O60341
Residue:852
BDBM113738
NameBDBM113738
Synonyms:4-(3-Hydrazinylpropyl) morpholine (11)
TypeSmall organic molecule
Emp. Form.C7H17N3O
Mol. Mass.159.2294
SMILESNNCCCN1CCOCC1